{"text_format":"1","workbook":"xlsx","n_sheets":49,"sheets":["Instructions","Info","Cover Sheet","Contact details","Environmental Outcomes","Environ Outcomes code","Land  Use - Site and Surrounds","Land use code","Piggery Description","Piggery Description code","Environmental Risk Assessment","ERA Vulnerability of Soils","ERA Vulnerability of soils Code","ERA Vulnerability Groundwater","ERA Vul groundwater code","ERA Vulnerability Surface Water","ERA Vul surface water code","ERA Vulnerability Community","ERA Vul community code","D&O RA Nutrient Monitoring","RA Nutrient Monitor code","D&O RA Manure Distribution","RA Manure Distr code","D&O RA Nutrient Loss Prevention","RA Nutrient Loss Preven code","D&O RA Paddock Rehab","RA Paddock Rehab code","D&O RA Mortalities Management","RA Mortalities Mgt code","D&O RA Odour, Dust, Noise","RA Odour, Dust, Noise code","Overall RA","Environmental Monitoring","Contingency Plans","Contingency Plans code","Records to be Kept","Records to be Kept code","EMP Review","Action Plans","Environ Training Record","Complaints Record","Complaints code","Environmental Monitoring Record","Manure Reuse Record","Manure Exports Record","Duty of Care","Pesticide Use Record","Environmental Incident Record","Pollution Data Monitoring Rpt"],"not_rendered":{"charts":0,"images":50,"macros":1,"external_links":1,"defined_names":153,"comments":0,"pivot_tables":0},"unopened":[],"bounds":{"document_bytes":16777216,"sheet_cells":100000,"rows_first":2000,"rows_last":500,"rows_between":2000,"halvings":0,"cell_chars":16384,"cell_head_chars":4096},"cells_cut":0,"cells_raw":0,"read":"whole","date_system":"1900"}

{"sheet":"Instructions","index":0,"n_rows":77,"n_cols":6,"rows_kept":77,"cut":false,"hidden":false,"merged":[[37,1,37,4],[36,1,36,4],[0,1,0,4],[1,2,1,3],[12,2,12,3],[13,2,13,3],[14,2,14,3],[15,2,15,3],[17,2,17,3],[11,2,11,3],[19,1,19,4]]}
[null,"Environmental Management Plan\n\nInstructions"]
[null,null,"Welcome to your EMP spreadsheet"]
[]
[]
[]
[]
{"$rows_left_out":72}
{"sheet":"Info","index":1,"n_rows":24,"n_cols":2,"rows_kept":24,"cut":false,"hidden":false,"merged":[[15,1,15,2],[17,1,17,2],[19,1,19,2],[13,1,13,2]]}
[]
[]
[]
[]
[]
[]
{"$rows_left_out":19}
{"sheet":"Cover Sheet","index":2,"n_rows":22,"n_cols":6,"rows_kept":22,"cut":false,"hidden":false,"merged":[[0,1,0,3]]}
[null,"Environmental Management Plan"]
[]
[null,null,"please insert piggery name",null," "]
[]
[]
[null,null,null,null,null," "]
{"$rows_left_out":17}
{"sheet":"Contact details","index":3,"n_rows":48,"n_cols":8,"rows_kept":48,"cut":false,"hidden":false,"merged":[[0,1,0,4]]}
[null,"Contact Details"]
[null,{"$f":"B4","v":"h1"},{"$f":"C4","v":"Piggery operator: "},"insert details"]
[null,">0"]
[null,"h1","Piggery operator: ","insert details"]
[null,1,"Street address:","insert details"]
[null,1,null,"insert details"]
{"$rows_left_out":43}
{"sheet":"Environmental Outcomes","index":4,"n_rows":25,"n_cols":5,"rows_kept":25,"cut":false,"hidden":false,"merged":[[0,1,0,4],[21,2,21,3]]}
[null,"Environmental Outcomes"]
[" ",null,null,null,{"$f":"E4","v":0}]
[]
[null,null,"To operate in an ecologically sustainable manner"]
[null,null,true]
[]
{"$rows_left_out":20}
{"sheet":"Environ Outcomes code","index":5,"n_rows":50,"n_cols":6,"rows_kept":50,"cut":false,"hidden":true,"merged":[[1,0,1,3]]}
[]
["Environmental Outcomes"]
[]
[]
[null,null,"Please tick one or more boxes if applicable"]
[]
{"$rows_left_out":45}
{"sheet":"Land  Use - Site and Surrounds","index":6,"n_rows":44,"n_cols":11,"rows_kept":44,"cut":false,"hidden":false,"merged":[[0,1,0,4]]}
[null,"Land  Use - Site and Surrounds"]
[]
[]
[null,null,"The land use zoning of the farm is"]
[]
[]
{"$rows_left_out":39}
{"sheet":"Land use code","index":7,"n_rows":118,"n_cols":11,"rows_kept":118,"cut":false,"hidden":true,"merged":[[1,1,1,2]]}
[]
[null,"Site Description"]
[]
[]
[]
[null,"Nearby land uses"]
{"$rows_left_out":113}
{"sheet":"Piggery Description","index":8,"n_rows":24,"n_cols":13,"rows_kept":24,"cut":false,"hidden":false,"merged":[[0,1,0,6],[20,3,20,6],[6,2,6,6]]}
[null,"Piggery Description"]
[null,{"$f":"B4","v":"h1"},{"$f":"C4","v":"The piggery unit type is "},{"$f":"D4","v":0}]
[null,">0",null,"breeder-weaner"]
[null,"h1","The piggery unit type is "]
[]
[]
{"$rows_left_out":19}
{"sheet":"Piggery Description code","index":9,"n_rows":65,"n_cols":12,"rows_kept":65,"cut":false,"hidden":true,"merged":[[1,1,1,5]]}
[]
[null,"Piggery Description"]
[null," "]
[null,"The piggery is a farrow-to-finish system with a total of 5000 pigs or 5000 SPU."]
[null,"The pigs are housed in a combination of conventional sheds and deep litter shelters."]
[]
{"$rows_left_out":60}
{"sheet":"Environmental Risk Assessment","index":10,"n_rows":10,"n_cols":3,"rows_kept":10,"cut":false,"hidden":false,"merged":[[0,1,0,3]]}
[null,"Environmental Risk Assessment"]
[]
[null,null,"The purpose of this environmental risk assessment is to identify any actual or likely impact that the piggery may pose to the environment."]
[null,null,"This provides the basis for reducing impacts (or risks of impacts) through improved design, improved management or monitoring."]
[null,null,"There are three steps in this process:"]
[null,null,"·  describe the vulnerability of the four amenity and natural resource areas: soils, groundwater, surface water and community amenity.  Each of these areas includes a number of statements that are used to determine the overall risk.  A risk rating is assigned to each statement within each area; a rating of 1 represents a very low level of vulnerability and 4 represents a very high level of vulnerability.  The overall vulnerability of each amenity or natural resource area is equal to the highest rating (1-4) recorded for a statement about that area."]
{"$rows_left_out":5}
{"sheet":"ERA Vulnerability of Soils","index":11,"n_rows":26,"n_cols":8,"rows_kept":26,"cut":false,"hidden":false,"merged":[[0,1,0,5]]}
[null,"Environmental Risk Assessment - Vulnerability Ratings\n\nSoils"]
[]
[null,null,"Rating Criteria","Response","Rating"]
[]
[null,null,"Paddocks used to run pigs are:",null,{"$f":"VLOOKUP(D5,'ERA Vulnerability of soils Code'!B12:C14,2,FALSE)","v":{"$error":"#N/A"}}]
[]
{"$rows_left_out":21}
{"sheet":"ERA Vulnerability of soils Code","index":12,"n_rows":64,"n_cols":7,"rows_kept":64,"cut":false,"hidden":true,"merged":[]}
["Environmental Risk Assessment - Vulnerability Ratings"]
[null," "]
["Soils","All tables in the risk assessment will be set up with pull down menus for each category."]
[null,"The highest number recorded for an individual item will transpose down to the overall rating."]
[]
[]
{"$rows_left_out":59}
{"sheet":"ERA Vulnerability Groundwater","index":13,"n_rows":13,"n_cols":6,"rows_kept":13,"cut":false,"hidden":false,"merged":[[0,1,0,5]]}
[null,"Environmental Risk Assessment - Vulnerability Ratings\n\nGoundwater"]
[]
[null,null,"Rating Criteria","Response","Rating"]
[]
[null,null,"The depth to groundwater is:",null,{"$f":"VLOOKUP(D5,'ERA Vul groundwater code'!B7:C12,2,FALSE)","v":{"$error":"#N/A"}}]
[]
{"$rows_left_out":8}
{"sheet":"ERA Vul groundwater code","index":14,"n_rows":30,"n_cols":8,"rows_kept":30,"cut":false,"hidden":true,"merged":[]}
["Environmental Risk Assessment - Vulnerability Ratings"]
[]
["Groundwater"]
[]
["Rating Criteria",null,"Rating"]
[]
{"$rows_left_out":25}
{"sheet":"ERA Vulnerability Surface Water","index":15,"n_rows":21,"n_cols":6,"rows_kept":21,"cut":false,"hidden":false,"merged":[[0,1,0,5]]}
[null,"Environmental Risk Assessment - Vulnerability Ratings\n\nSurface Waters"]
[]
[null,null,"Rating Criteria","Response","Rating"]
[]
[null,null,"Paddocks used to run pigs are located:",null,{"$f":"VLOOKUP(D5,'ERA Vul surface water code'!B10:C12,2,FALSE)","v":{"$error":"#N/A"}}]
[]
{"$rows_left_out":16}
{"sheet":"ERA Vul surface water code","index":16,"n_rows":46,"n_cols":7,"rows_kept":46,"cut":false,"hidden":true,"merged":[]}
["Environmental Risk Assessment - Vulnerability Ratings"]
[]
["Surface Water"]
[]
["You re-use on-farm surface waters",true]
[null,false]
{"$rows_left_out":41}
{"sheet":"ERA Vulnerability Community","index":17,"n_rows":13,"n_cols":9,"rows_kept":13,"cut":false,"hidden":false,"merged":[[0,1,0,5]]}
[null,"Environmental Risk Assessment - Vulnerability Ratings\n\nCommunity Amenity"]
[]
[null,null,"Rating Criteria","Response","Rating"]
[]
[null,null,"The piggery has received:",null,{"$f":"VLOOKUP(D5,'ERA Vul community code'!B7:C10,2,FALSE)","v":{"$error":"#N/A"}},null,null,null," "]
[]
{"$rows_left_out":8}
{"sheet":"ERA Vul community code","index":18,"n_rows":22,"n_cols":3,"rows_kept":22,"cut":false,"hidden":true,"merged":[]}
["Environmental Risk Assessment - Vulnerability Ratings"]
[]
["Community Amenity"]
[]
["Rating Criteria",null,"Rating"]
[]
{"$rows_left_out":17}
{"sheet":"D&O RA Nutrient Monitoring","index":19,"n_rows":21,"n_cols":7,"rows_kept":21,"cut":false,"hidden":false,"merged":[[0,1,0,5]]}
[null,"Design and Operation Risk Assessment\n\nNutrient Monitoring"]
[]
[null,null,"The usual length of the pig phase on an area of land is:",null,"months"]
[]
[null,null,"The usual length of a paddock rotation (pig phase and crop / pasture / forage phase) is",null,"years"]
[]
{"$rows_left_out":16}
{"sheet":"RA Nutrient Monitor code","index":20,"n_rows":42,"n_cols":5,"rows_kept":42,"cut":false,"hidden":true,"merged":[]}
[]
[null,"Risk Assessment - Nutrient Budgeting and Monitoring"]
[]
[]
[null,"Nutrient Budget and Monitoring","Rating Criteria","Rating"]
[]
{"$rows_left_out":37}
{"sheet":"D&O RA Manure Distribution","index":21,"n_rows":26,"n_cols":9,"rows_kept":26,"cut":false,"hidden":false,"merged":[[0,1,0,5]]}
[null,"Design and Operation Risk Assessment\n\nDistribution of Manure Nutrients"]
[]
[null,{"$f":"IF(breeder=\"has a breeder unit\",1,0)","v":0},"This piggery"]
[]
[null,{"$f":"IF(grower=\"has a grower unit\",1,0)","v":0},"This piggery"]
[]
{"$rows_left_out":21}
{"sheet":"RA Manure Distr code","index":22,"n_rows":84,"n_cols":7,"rows_kept":84,"cut":false,"hidden":true,"merged":[[1,0,1,4],[3,0,3,4]]}
[]
["Design and Operation Risk Assessment"]
[]
["Distribution of Manure Nutrients"]
[null,null,null,null,null,null,"has a breeder unit"]
[null,"Distribution of Manure Nutrients","Rating Criteria","Rating",null,null,"doesn't have a breeder unit"]
{"$rows_left_out":79}
{"sheet":"D&O RA Nutrient Loss Prevention","index":23,"n_rows":20,"n_cols":5,"rows_kept":20,"cut":false,"hidden":false,"merged":[[0,1,0,5]]}
[null,"Design and Operation Risk Assessment\n\nNutrient Loss Prevention"]
[]
[null,null,"Rating Criteria","Response","Rating"]
[]
[null,null,"Potential nutrient loss pathways:",null,{"$f":"VLOOKUP(D5,'RA Nutrient Loss Preven code'!C7:D12,2,FALSE)","v":{"$error":"#N/A"}}]
[]
{"$rows_left_out":15}
{"sheet":"RA Nutrient Loss Preven code","index":24,"n_rows":38,"n_cols":5,"rows_kept":38,"cut":false,"hidden":true,"merged":[[1,0,1,4],[3,0,3,4]]}
[]
["Design and Operation Risk Assessment"]
[]
["Nutrient Loss Prevention"]
[]
[null,"Rating Criteria","Response","Rating"]
{"$rows_left_out":33}
{"sheet":"D&O RA Paddock Rehab","index":25,"n_rows":28,"n_cols":6,"rows_kept":28,"cut":false,"hidden":false,"merged":[[0,1,0,5]]}
[null,"Design and Operation Risk Assessment\n\nPaddock Rehabilitation"]
[]
[null,{"$f":"IF(erosion=\"not generally an issue.\",0,1)","v":1},"Soil erosion from the pig paddocks is"]
[]
[null,{"$f":"IF(compaction=\"not generally an issue.\",0,1)","v":1},"Soil compaction in the pig paddocks is "]
[]
{"$rows_left_out":23}
{"sheet":"RA Paddock Rehab code","index":26,"n_rows":57,"n_cols":9,"rows_kept":57,"cut":false,"hidden":true,"merged":[[1,0,1,4],[3,0,3,4]]}
[]
["Design and Operation Risk Assessment"]
[]
["Paddock Rehabilitation"]
[]
[null,"Rating Criteria","Response","Rating"]
{"$rows_left_out":52}
{"sheet":"D&O RA Mortalities Management","index":27,"n_rows":26,"n_cols":6,"rows_kept":26,"cut":false,"hidden":false,"merged":[[0,1,0,5]]}
[null,"Design and Operation Risk Assessment\n\nMortalities Management\n\n"]
[]
[null,null,"Rating Criteria","Response","Rating"]
[]
[null,null,"Dead pigs are:",null,{"$f":"VLOOKUP(D5,'RA Mortalities Mgt code'!C7:D10,2,FALSE)","v":{"$error":"#N/A"}}]
[]
{"$rows_left_out":21}
{"sheet":"RA Mortalities Mgt code","index":28,"n_rows":52,"n_cols":5,"rows_kept":52,"cut":false,"hidden":true,"merged":[[1,0,1,4],[3,0,3,4]]}
[]
["Design and Operation Risk Assessment"]
[]
["Mortalities Management"]
[]
[null,"Rating Criteria","Response","Rating"]
{"$rows_left_out":47}
{"sheet":"D&O RA Odour, Dust, Noise","index":29,"n_rows":22,"n_cols":5,"rows_kept":22,"cut":false,"hidden":false,"merged":[[0,1,0,5]]}
[null,"Design and Operation Risk Assessment\n\nOdour, Dust and Noise"]
[]
[]
[null,null,"Rating Criteria","Response","Rating"]
[]
[null,null,"Odour, dust and noise are:",null,{"$f":"VLOOKUP(D6,'RA Odour, Dust, Noise code'!C7:D9,2,FALSE)","v":{"$error":"#N/A"}}]
{"$rows_left_out":17}
{"sheet":"RA Odour, Dust, Noise code","index":30,"n_rows":33,"n_cols":5,"rows_kept":33,"cut":false,"hidden":true,"merged":[[1,0,1,4],[3,0,3,4]]}
[]
["Design and Operation Risk Assessment"]
[]
["Odour, Dust and Noise"]
[]
[null,"Rating Criteria","Response","Rating"]
{"$rows_left_out":28}
{"sheet":"Overall RA","index":31,"n_rows":21,"n_cols":8,"rows_kept":21,"cut":false,"hidden":false,"merged":[[0,1,0,8],[3,4,3,7],[7,2,7,3]]}
[null,"Overall  Risk Assessment"]
[]
[null,null," "]
[null,null,null,null,"Natural Resource Vulnerability Ratings (1-4)"]
[null,null,null,null,"Soils","Groundwater","Surface","Community"]
[null,null,null,null,null,"Quality &","Quality &","Amenity"]
{"$rows_left_out":16}
{"sheet":"Environmental Monitoring","index":32,"n_rows":45,"n_cols":7,"rows_kept":45,"cut":false,"hidden":false,"merged":[[8,2,8,3],[23,2,24,2],[28,2,28,3],[31,2,31,3],[0,1,0,4],[3,2,3,3],[11,2,12,2],[13,2,14,2],[15,2,16,2],[17,2,18,2],[20,2,21,2]]}
[null,"Environmental Monitoring and Assessment of Sustainability"]
[]
[null,null,"Community Amenity"]
[null,null,"Management aims for the piggery to operate in harmony with the nearby community."]
[null,null,"One measure of the impact of the piggery on nearby residents is the number of complaints received."]
[null,null,"Details of complaints management are documented in the \"Complaints Register\""]
{"$rows_left_out":40}
{"sheet":"Contingency Plans","index":33,"n_rows":52,"n_cols":4,"rows_kept":52,"cut":false,"hidden":false,"merged":[[2,2,2,3],[3,2,3,3],[0,1,0,5]]}
[null,"Contingency Plans"]
[]
[null,null,"Contingency plans are needed to address potential emergency situations that pose a risk to the environment."]
[null,null,"It is not possible to identify all possible emergency situations and further situations may be identified in the future."]
[]
[null,null,"In the event of an emergency situation, the 24 hour contact phone number is: ","Enter phone number"]
{"$rows_left_out":47}
{"sheet":"Contingency Plans code","index":34,"n_rows":87,"n_cols":5,"rows_kept":87,"cut":false,"hidden":true,"merged":[[0,0,0,6]]}
["Contingency Plans"]
[]
[null,"Contingency plans are needed to address potential emergency situations that pose a risk to the environment."]
[null,"It is not possible to identify all possible emergency situations and further situations may be identified in the future."]
[]
[null,"In the event of an emergency situation, the 24 hour contact phone number is: ","Enter phone number"]
{"$rows_left_out":82}
{"sheet":"Records to be Kept","index":35,"n_rows":15,"n_cols":5,"rows_kept":15,"cut":false,"hidden":false,"merged":[[14,2,14,3],[0,1,0,5],[3,3,3,4],[9,2,9,4],[10,2,10,4],[12,2,12,4]]}
[null,"Records to be Kept"]
[]
[]
[null,null,null,"Please select the records that you already keep or intend to keep/develop"]
[null,null,null,"Records","Note"]
[null,null,null,null,"Environmental Management Plan (EMP) Review: all EMPs should include this record. \nAction Plans: plans to improve design or management to reduce risk. \nEnvironmental Training Record: all EMPs should include this record. \nComplaints Record: all EMPs should include this record. \nEnvironmental Monitoring Record: if enviromental monitoring is undertaken then this record should be kept. \nManure Reuse Record: uou should keep this record if you spread spent bedding on reuse areas that are separate from the pig paddocks. \nManure Export Record: you should keep this record if you are exporting any spent bedding for reuse. \nDuty of Care for Off-site users: you should keep this record if you are exporting any manure for reuse. \nPesticide Use Record: this applies if you use herbicides, insecticides or baits. \nEnvironmental Incident Record: all EMPs should include this record. \nPollution Monitoring Data Report: applicable for licenced NSW operations. \nNGERS on-line reporting: refer below"]
{"$rows_left_out":10}
{"sheet":"Records to be Kept code","index":36,"n_rows":26,"n_cols":7,"rows_kept":26,"cut":false,"hidden":true,"merged":[[0,0,0,5],[3,6,14,6]]}
["Records to be Kept"]
[null,null," "," "]
[null,null," "," "]
[null,"EMP Review","All EMPs should include this record.",null,"EMP Review All EMPs should include this record.",null,"EMP Review: all EMPs should include this record. \nAction Plans: plans to improve design or management to reduce risk. \nEnvironmental Training Record: all EMPs should include this record. \nComplaints Record: all EMPs should include this record. \nEnvironmental Monitoring Record: if enviromental monitoring is undertaken then this record should be kept. \nManure Reuse Record: uou should keep this record if you spread spent bedding on reuse areas that are separate from the pig paddocks. \nManure Export Record: you should keep this record if you are exporting any spent bedding for reuse. \nDuty of Care for Off-site users: you should keep this record if you are exporting any manure for reuse. \nPesticide Use Record: this applies if you use herbicides, insecticides or baits. \nEnvironmental Incident Record: all EMPs should include this record. \nPollution Monitoring Data Report: applicable for licenced NSW operations. \nNGERS on-line reporting: refer below"]
[null,"Action Plans","Plans to improve design or management to reduce risk",null,"Action Plans Plans to improve design or management to reduce risk"]
[null,"Environmental Training Record","All EMPs should include this record.",null,"Environmental Training Record All EMPs should include this record."]
{"$rows_left_out":21}
{"sheet":"EMP Review","index":37,"n_rows":10,"n_cols":7,"rows_kept":10,"cut":false,"hidden":false,"merged":[[0,1,0,7]]}
[null,"EMP Review"]
[]
[null,null,"This EMP will be reviewed annually and also whenever significant changes in piggery design or management occur."]
[null,null," "]
[null,null,"Records will be updated as needed."]
[]
{"$rows_left_out":5}
{"sheet":"Action Plans","index":38,"n_rows":3,"n_cols":8,"rows_kept":3,"cut":false,"hidden":false,"merged":[[0,1,0,8]]}
[null,"Action Plans"]
[]
[null,null,"Date","Contact name","Need identified","Proposed actions (including dates)","Actions taken (including dates)","Signature"]

{"sheet":"Environ Training Record","index":39,"n_rows":5,"n_cols":10,"rows_kept":5,"cut":false,"hidden":false,"merged":[[0,1,0,10]]}
[null,"Environmental Training Record"]
[]
[]
[null,null,"Date of Training","Trainee Name","Training Type","Training Provider","Training Hours","Training Outcomes","Supervisor Signature (Signature & Date)","Trainee (Signature & Date)"]
[null,null,null," ",null," "," ","e.g. approval to use chemicals"]

{"sheet":"Complaints Record","index":40,"n_rows":59,"n_cols":9,"rows_kept":59,"cut":false,"hidden":false,"merged":[[36,3,36,4],[0,1,0,5],[3,3,3,4],[5,3,5,4],[7,3,7,4],[9,3,9,4],[11,3,11,4],[17,3,19,4],[28,3,28,4],[30,3,30,4],[32,3,32,4],[34,3,34,4],[56,3,56,4],[58,3,58,4],[38,3,38,4],[41,3,41,4],[43,3,43,4],[48,3,48,4],[50,3,50,4],[54,3,54,4]]}
[null,"Complaints Record"]
[]
[null,null,"Complaint Details"]
[null,null,"Date of complaint:","insert details"]
[]
[null,null,"Time of complaint:","insert details"]
{"$rows_left_out":54}
{"sheet":"Complaints code","index":41,"n_rows":93,"n_cols":18,"rows_kept":93,"cut":false,"hidden":true,"merged":[[69,3,69,13],[0,1,0,14],[4,3,4,13],[6,3,6,13],[8,3,8,13],[10,3,10,13],[12,3,12,13],[27,3,29,13],[61,3,61,13],[63,3,63,13],[65,3,65,13],[67,3,67,13],[90,3,90,13],[92,3,92,13],[71,3,71,13],[75,3,75,13],[77,3,77,13],[82,3,82,13],[84,3,84,13],[88,3,88,13]]}
[null,"Complaints Record"]
[]
[null,null,"Complaint Details"]
[]
[null,null,"Date of complaint:"," "]
[]
{"$rows_left_out":88}
{"sheet":"Environmental Monitoring Record","index":42,"n_rows":4,"n_cols":8,"rows_kept":4,"cut":false,"hidden":false,"merged":[[0,1,0,8]]}
[null,"Environmental Monitoring Record"]
[]
[null,null,"Date","Element","Action","Further Actions Needed","Name","Signature"]
[null,null,null,"e.g. soil, spent bedding, manure, surface water, groundwater","e.g. sampling, sample dispatch, results received, results sent to regulators, results filed (where), results put on website"]

{"sheet":"Manure Reuse Record","index":43,"n_rows":20,"n_cols":15,"rows_kept":20,"cut":false,"hidden":false,"merged":[[0,1,0,15]]}
[null,"Manure Reuse Record"]
[]
[null,null,"Date ","Mass of  Manure (t)","Paddock for Spreading","Area  Spread (ha)","Spreading Rate (DM t/ha)","N Concentration (kg/t DM)","P  Concentration (kg/t DM)","K  Concentration (kg/t DM)","N Application (kg/ha)","P Application (kg/ha)","K Application (kg/ha)","Name ","Signature "]
[null,null,null,null,null,null,{"$f":"+D4/F4","v":{"$error":"#DIV/0!"}},null,null,null,{"$f":"+G4*$H4","v":{"$error":"#DIV/0!"}},{"$f":"+H4*$H4","v":0},{"$f":"+I4*$H4","v":0}]
[null,null,null,null,null,null,{"$f":"+D5/F5","v":{"$error":"#DIV/0!"}},null,null,null,{"$f":"+G5*$H5","v":{"$error":"#DIV/0!"}},{"$f":"+H5*$H5","v":0},{"$f":"+I5*$H5","v":0}]
[null,null,null,null,null,null,{"$error":"#DIV/0!"},null,null,null,{"$error":"#DIV/0!"},0,0]
{"$rows_left_out":15}
{"sheet":"Manure Exports Record","index":44,"n_rows":3,"n_cols":13,"rows_kept":3,"cut":false,"hidden":false,"merged":[[0,1,0,13]]}
[null,"Manure Exports Record"]
[]
[null,null,"Date ","Description e.g. aged spent bedding","Quantity (t / m3)","Recipient Name","Recipient Address","Recipient Phone No.","Intended Use","Analysis Provided?","Duty of Care Statement Provided?","Name ","Signature "]

{"sheet":"Duty of Care","index":45,"n_rows":28,"n_cols":4,"rows_kept":28,"cut":false,"hidden":false,"merged":[[0,1,0,3]]}
[null,"Duty of Care for Off-Site Users"]
[]
[null,null,"Aged spent bedding and bedding compost from piggeries are great sources of nutrients for plant growth and carbon for building soil structure.  "]
[null,null,"However, like inorganic fertilisers, they need to be spread on suitable areas and applied at sustainable rates to ensure the environment is protected.  "]
[null,null,"Those utilising spent bedding or compost must take all reasonable and practical steps to prevent harm to the environment and to areas of cultural heritage sensitivity.  "]
[null,null,"Each state has its own Acts detailing duty of care provisions.  These typically require: "]
{"$rows_left_out":23}
{"sheet":"Pesticide Use Record","index":46,"n_rows":6,"n_cols":11,"rows_kept":6,"cut":false,"hidden":false,"merged":[[0,1,2,11]]}
[null,"Pesticide Use Record"]
[]
[]
[]
[null,null,"Date","Name","Type of Pesticide","Product Name","Location Used","Method of Use","Quantity Used","Name","Signature"]
[null,null,null,null,"e.g. herbicide, rat bait, insecticide"]
{"$rows_left_out":1}
{"sheet":"Environmental Incident Record","index":47,"n_rows":5,"n_cols":10,"rows_kept":5,"cut":false,"hidden":false,"merged":[[0,1,2,10]]}
[null,"Environmental Incident Record"]
[]
[]
[]
[null,null,"Date","Name","Incident Description","Actions Taken (including regulator contact)","Corrective / Preventative Actions Needed","Corrective / Preventative Actions Taken (including date)","Name","Signature"]

{"sheet":"Pollution Data Monitoring Rpt","index":48,"n_rows":38,"n_cols":11,"rows_kept":38,"cut":false,"hidden":false,"merged":[[37,2,37,7],[0,1,2,9],[10,2,10,8],[4,2,4,8],[6,2,6,8],[8,2,8,8],[9,2,9,8],[19,3,19,8],[11,2,11,8],[14,3,14,8],[15,3,15,8],[16,3,16,8],[17,3,17,8],[18,3,18,8],[12,2,12,4]]}
[null,"Pollution Data Monitoring Report"]
[]
[]
[]
[null,null,"Under the NSW Protection of the Environment Operations Act 1997 (POEO Act), holders of environment protection licences (licensees) must publish or make pollution monitoring data available to members of the public."]
[null,null," "]
{"$rows_left_out":32}